{"text_format":"1","workbook":"xlsx","n_sheets":7,"sheets":["Introduction and guidance","Flock input details","Diet input details","Results","References and assumptions log","Calculations - Data tables","Calculations - Dataset"],"not_rendered":{"charts":0,"images":2,"macros":1,"external_links":2,"defined_names":8,"comments":0,"pivot_tables":0},"unopened":[],"bounds":{"document_bytes":16777216,"sheet_cells":100000,"rows_first":2000,"rows_last":500,"rows_between":2000,"halvings":0,"cell_chars":16384,"cell_head_chars":4096},"cells_cut":0,"cells_raw":0,"read":"whole","date_system":"1900"}

{"sheet":"Introduction and guidance","index":0,"n_rows":79,"n_cols":33,"rows_kept":79,"cut":false,"hidden":false,"merged":[[41,2,42,12],[41,13,42,15],[43,2,63,14],[36,2,37,14],[34,2,34,4],[35,2,35,14],[38,2,38,14],[39,2,39,14],[40,2,40,3],[40,4,40,6],[40,7,40,9],[40,10,40,12],[9,2,12,14],[33,5,33,6],[34,5,34,6],[33,11,33,14],[34,11,34,14],[33,7,33,10],[34,7,34,10],[16,2,17,14],[14,2,15,14],[18,2,31,14],[32,2,32,14],[33,2,33,4]]}
[]
[]
[]
[]
[]
[]
[]
[]
[]
[null,null,"Broiler excreta mass balance model"]
[]
[]
[]
[]
[null,null,"Nutritional Management Best Available Techniques for Poultry\n(click here to see regulations)"]
{"$rows_left_out":65}
{"sheet":"Flock input details","index":1,"n_rows":23,"n_cols":7,"rows_kept":23,"cut":false,"hidden":false,"merged":[[2,6,20,12],[22,6,24,12],[3,1,3,2],[9,3,9,4]]}
[null,null,null,null,"Input data - flock details"]
[]
[null,"Flock input table 1:",null,null,null,null,"\nFlock details input instructions\n \nPlease note: One complete workbook needs to be filled out per management system on your farm.  \n\nFlock input table 1:\nEnter number of birds per cycle and number of days between the final clearance and the next cycle in the two white boxes. Note this should reflect the number of birds per cycle not the total annual number of birds. The number of birds per cycle entry cell will go red if the value entered is below 40,000 rearing places, the BAT regulation limit. If you have under 40,000 birds you can still use this tool as normal.\nNote: Number of cycles will not calculate correctly until Flock input table 2 is completed.\n\nFlock input table 2:\nEnter the age of thin(s) to the flock in days and the percentage of birds taken each time in the white boxes. Note, the percentage of thins and clear should total 100%.\n\nFlock input table 3:\nEnter a FCR value.  The target value is the average from the performance data.  The difference between these will be calculated and used to update the performance data.  If the FCR value is not known, this can be left blank and the target value will be used.\nEnter a value for the bodyweight at clear.  The target value is from the performance data.  The difference between these will be calculated and used to adjust the performance data. \n\nFlock input table 4:\nEnter a percentage value for 7 day mortality in the white box."]
[null,"Per Shed/Farm"]
[null,"Number of birds per cycle"]
[null,"Days empty between cycles"]
[null,"Number of cycles per year",{"$f":"IF(C6=\"\",\"\",(365/(C13+C6)))","v":""}]
[]
[null,"Flock input table 2: "]
[null,"Flock Program Summary","Days","Thinning percentage"]
[null,"Age of 1st thin",null,"% 1st thin"]
[null,"Age of 2nd thin",null,"% 2nd thin"]
[null,"Age of clear",null,"% clear"]
[null,null,null,null,{"$f":"SUM(E11:E13)","v":0}]
[]
{"$rows_left_out":9}
{"sheet":"Diet input details","index":2,"n_rows":32,"n_cols":8,"rows_kept":32,"cut":false,"hidden":false,"merged":[[3,7,27,11],[31,1,31,3],[3,1,3,5],[17,1,17,5],[30,1,30,4],[4,1,4,2],[14,1,14,2],[18,1,18,2]]}
[null,null,null,null,"Input data - diet details"]
[]
[null,"Diet input table 1:"]
[null,"Diet Details",null,null,null,null,null,"\nFlock details input instructions\n\nDiet input table 1:\nPlease input protein and phosphorus levels (values can be found on all feed declaration tickets) for the appropriate diets in the white boxes in the \"Diet Details\" table.\nIf the diets are the same (e.g. Grower 1 and 2), then please put the same protein and phosphorus values in both respective sets of boxes.\nIf feed diet groups are not used then leave the cells blank and move on to the next used group.\nEditable entry cells can be used to add a description/name to the feed rations you use. There is a separate row for composition of Whole Wheat. If Whole Wheat is not fed these cells can be left blank.\n\nDiet input table 2:\nEnter the start and end days within the production cycle for each diet including the proportion (percentage of total ration fed) of the diet that is made up using Whole Wheat in the final column.\nPlease note the Feed Start Day should be one higher than the previous ration Feed End Day.\nThe final Feed End Day should be less than or equal to the day of clear, found on Flock Input Details page.\n\nDiet input table 3:\nState the level of phytase used within the diet. This is a drop down box with predefined additive values, please select the value closest to your phytase addition to feed."]
[null,"Diet",null,"Crude Protein (%)","Total Nitrogen (%)","Total Phosphorus (%)"]
[null,"Ration 1","Editable entry cell",null,{"$f":"D6/6.25","v":0}]
[null,"Ration 2","Editable entry cell",null,{"$f":"D7/6.25","v":0}]
[null,"Ration 3","Editable entry cell",null,0]
[null,"Ration 4","Editable entry cell",null,0]
[null,"Ration 5","Editable entry cell",null,0]
[null,"Ration 6","Editable entry cell",null,0]
[null,"Ration 7","Editable entry cell",null,0]
[null,"Ration 8","Editable entry cell",null,0]
[null,"Ration 9","Editable entry cell",null,{"$f":"D14/6.25","v":0}]
[null,"Whole Wheat",null,null,{"$f":"D15/6.25","v":0}]
{"$rows_left_out":18}
{"sheet":"Results","index":3,"n_rows":26,"n_cols":13,"rows_kept":26,"cut":false,"hidden":false,"merged":[[23,5,23,7],[24,5,24,7],[25,5,25,7],[11,1,11,3],[10,1,10,7],[11,4,11,7],[23,2,23,3],[24,2,24,3],[25,2,25,3],[22,2,22,7],[6,12,18,16],[14,2,14,4],[14,7,14,8],[3,7,3,8],[3,9,3,10],[3,1,3,2],[3,3,3,4],[7,1,7,3],[8,1,8,3],[6,1,6,7],[7,4,7,7],[8,4,8,7]]}
[null,null,null,null,null,null,"Export data - emission levels"]
[]
[]
[null,"Installation name:",null,{"$f":"'Introduction and guidance'!E41","v":0},null,null,null,"Permit Number:",null,{"$f":"'Introduction and guidance'!K41","v":0}]
[]
[]
[null,"BAT Emission Level",null,null,null,null,null,null,null,null,null,null,"\nResults sheet instructions\n\nUse the data given in this box to demonstrate compliance with the nitrogen and phosphorus excretion levels.\n\nBased on the data entered within the diet and flock details input the emission levels are calculated within the BAT Emission level box, and colour coded green to show compliance with the upper limits of the BAT standards. If the cells turn red then the emission levels are not compliant.\n\n   -  Nitrogen upper limit = 0.6kg N/animal/place/year\n   -  Phosphorus upper limit = 0.25kg P/animal place/year \n\n\n"]
[null,"Nitrogen excreted\nPer animal place (kg N/ Year)",null,null,"Phosphorus excreted\nPer animal place (kg P/ Year)"]
[null,{"$f":"H20","v":{"$error":"#VALUE!"}},null,null,{"$f":"I20","v":{"$error":"#VALUE!"}}]
[]
[null,"Percentage of BAT upper Limit"]
[null,{"$f":"B9/0.6","v":{"$error":"#VALUE!"}},null,null,{"$f":"E9/0.25","v":{"$error":"#VALUE!"}}]
[]
[]
[null,null,"Intake Data",null,null,null,null,"Emission Data"]
{"$rows_left_out":12}
{"sheet":"References and assumptions log","index":4,"n_rows":10,"n_cols":10,"rows_kept":10,"cut":false,"hidden":true,"merged":[]}
["References and assumptions log"]
[]
["Unique ID","Description with key details ","Location in workbook","Link to evidence","Date of last update","Initials","Methodology behind assumption","Assumptions","Any other comments","Reference or assumption"]
["Poultry 01","This table presents performance data on broilers form  ROSS308 produced by Aviagen",{"$f":"CELL(\"address\",'Calculations - Data tables'!B4)","v":"'[Broiler_Model draft_V3_Password protected.xlsm]Calculations - Data tables'!$B$4"},"RossxRoss308-BroilerPerformanceObjectives2022-EN.pdf (aviagen.com)",44977,"LR","This data has been used to pull out body weight and cumulative intake values for poultry.","The data is presented in grams per day.","Updated data tables from those previously used in the AIC models.","Reference"]
["Poultry 02","Nitrogen Conversion Factor",{"$f":"CELL(\"address\",'Calculations - Data tables'!B68)","v":"'[Broiler_Model draft_V3_Password protected.xlsm]Calculations - Data tables'!$B$68"},"FAO (N.D>) https://www.fao.org/3/y5022e/y5022e03.htm#:~:text=On%20the%20basis%20of%20early,nitrogen%20content%20into%20protein%20content.",44977,"LR","This factor is used to convert crude protein content of feed to nitrogen.","Does not consider specifics of individual feeds but is a standardised factor used within the industry.","None.","Reference"]
["Poultry 03","Effect of Phytase on intake and excretion of dry matter, phosphorus, and nitrogen ",{"$f":"CELL(\"address\",'Calculations - Data tables'!B76)","v":"'[Broiler_Model draft_V3_Password protected.xlsm]Calculations - Data tables'!$B$76"},"Assuena V. et al., (2009), Effect of Dietary Phytase Supplementation on the Performance, Bone Densitometry, and Phosphorus and Nitrogen Excretion of Broilers. ",44978,"LR","This data has been used to calculate the impact of including phytase in the diet on the excretion of phosphorus.","Previously referenced in the AIC Broiler model.","Data limitation - This data is taken from a South American paper, and the diet is based on corn and soybean, on only 38-42d old broilers in a full metabolism trial.","Reference"]
["Poultry 04","Phytase feed additives effect on nitrogen","None","None",44978,"LR","None","Within the model calculations nitrogen is not impacted by phytase, this is an assumption based on current literature. ","This can be updated in the model a link is found.","Assumption"]
["Poultry 05","N and P retention factors from a study on phytase feed addition","None","Assuena V. et al., (2009), Effect of Dietary Phytase Supplementation on the Performance, Bone Densitometry, and Phosphorus and Nitrogen Excretion of Broilers. ",44978,"LR","This data has been used to calculate the impact of including phytase in the diet on the excretion of phosphorus.","The N and P retention factors do not require editing by user - the factors used in this model are from Assuena et al. (2009). Control N and P retention values used within this model are also from this study.","This can be updated in the model a link is found.","Assumption"]
["Poultry 06","Liveweight data","None","None",44978,"LR","None","We have included weighted average and liveweight to the dataset page as these are not required to be updated by the input user.","None","Assumption"]
["Poultry 07","Broiler performance data","None","None",44978,"LR","None","Currently the broiler performance data is based on \"As Hatched\" data which means it is a combination of both sexes.","None","Assumption"]

{"sheet":"Calculations - Data tables","index":5,"n_rows":84,"n_cols":10,"rows_kept":84,"cut":false,"hidden":true,"merged":[]}
["Data tables holding background data"]
[]
["Table 1. Poultry cumulative feed intake"]
["Source: ","Poultry 01","ROSS 308"]
["This table presents performance data on broilers form  ROSS308 produced by Aviagen"]
[]
["Day","Weight (g)","Target adjusted weight (g)","Daily Gain (g)","Average Daily Gain (g)","Daily Intake (g)","Cumulative Intake (g)","FCR","Target adjusted FCR","FCR/7 Day Mort Adjusted Cum Feed "]
[0,0,{"$f":"Table2[[#This Row],[Weight (g)]]*Table18[% of Target bodyweight]","v":0},null,null,null,null,null,{"$f":"Table2[[#This Row],[FCR]]*Table1820[% of Target bodyweight]","v":0},{"$f":"IF('Flock input details'!$C$18>0,(Table2[[#This Row],[Target adjusted weight (g)]]*Table2[[#This Row],[Target adjusted FCR]]),(Table2[[#This Row],[Target adjusted weight (g)]]*Table2[[#This Row],[FCR]]))","v":0}]
[1,62,{"$f":"Table2[[#This Row],[Weight (g)]]*Table18[% of Target bodyweight]","v":62},18,null,null,12,0.19600000000000001,{"$f":"Table2[[#This Row],[FCR]]*Table1820[% of Target bodyweight]","v":0.19600000000000001},{"$f":"IF('Flock input details'!$C$18>0,(Table2[[#This Row],[Target adjusted weight (g)]]*Table2[[#This Row],[Target adjusted FCR]]),(Table2[[#This Row],[Target adjusted weight (g)]]*Table2[[#This Row],[FCR]]))","v":12.152000000000001}]
[2,81,{"$f":"Table2[[#This Row],[Weight (g)]]*Table18[% of Target bodyweight]","v":81},19,null,16,28,0.35199999999999998,{"$f":"Table2[[#This Row],[FCR]]*Table1820[% of Target bodyweight]","v":0.35199999999999998},{"$f":"IF('Flock input details'!$C$18>0,(Table2[[#This Row],[Target adjusted weight (g)]]*Table2[[#This Row],[Target adjusted FCR]]),(Table2[[#This Row],[Target adjusted weight (g)]]*Table2[[#This Row],[FCR]]))","v":28.511999999999997}]
[3,102,{"$f":"Table2[[#This Row],[Weight (g)]]*Table18[% of Target bodyweight]","v":102},21,null,20,48,0.47599999999999998,{"$f":"Table2[[#This Row],[FCR]]*Table1820[% of Target bodyweight]","v":0.47599999999999998},{"$f":"IF('Flock input details'!$C$18>0,(Table2[[#This Row],[Target adjusted weight (g)]]*Table2[[#This Row],[Target adjusted FCR]]),(Table2[[#This Row],[Target adjusted weight (g)]]*Table2[[#This Row],[FCR]]))","v":48.552}]
[4,125,{"$f":"Table2[[#This Row],[Weight (g)]]*Table18[% of Target bodyweight]","v":125},23,null,24,72,0.57699999999999996,{"$f":"Table2[[#This Row],[FCR]]*Table1820[% of Target bodyweight]","v":0.57699999999999996},{"$f":"IF('Flock input details'!$C$18>0,(Table2[[#This Row],[Target adjusted weight (g)]]*Table2[[#This Row],[Target adjusted FCR]]),(Table2[[#This Row],[Target adjusted weight (g)]]*Table2[[#This Row],[FCR]]))","v":72.125}]
[5,151,{"$f":"Table2[[#This Row],[Weight (g)]]*Table18[% of Target bodyweight]","v":151},26,null,27,100,0.65800000000000003,{"$f":"Table2[[#This Row],[FCR]]*Table1820[% of Target bodyweight]","v":0.65800000000000003},{"$f":"IF('Flock input details'!$C$18>0,(Table2[[#This Row],[Target adjusted weight (g)]]*Table2[[#This Row],[Target adjusted FCR]]),(Table2[[#This Row],[Target adjusted weight (g)]]*Table2[[#This Row],[FCR]]))","v":99.358000000000004}]
[6,181,{"$f":"Table2[[#This Row],[Weight (g)]]*Table18[% of Target bodyweight]","v":181},29,null,31,131,0.72399999999999998,{"$f":"Table2[[#This Row],[FCR]]*Table1820[% of Target bodyweight]","v":0.72399999999999998},{"$f":"IF('Flock input details'!$C$18>0,(Table2[[#This Row],[Target adjusted weight (g)]]*Table2[[#This Row],[Target adjusted FCR]]),(Table2[[#This Row],[Target adjusted weight (g)]]*Table2[[#This Row],[FCR]]))","v":131.04399999999998}]
[7,213,{"$f":"Table2[[#This Row],[Weight (g)]]*Table18[% of Target bodyweight]","v":213},32,24,35,166,0.78,{"$f":"Table2[[#This Row],[FCR]]*Table1820[% of Target bodyweight]","v":0.78},{"$f":"IF('Flock input details'!$C$18>0,(Table2[[#This Row],[Target adjusted weight (g)]]*Table2[[#This Row],[Target adjusted FCR]]),(Table2[[#This Row],[Target adjusted weight (g)]]*Table2[[#This Row],[FCR]]))","v":166.14000000000001}]
{"$rows_left_out":70}
{"sheet":"Calculations - Dataset","index":6,"n_rows":171,"n_cols":13,"rows_kept":171,"cut":false,"hidden":true,"merged":[]}
["Calculations"]
[]
["Table 1. Bodyweight and Cumulative feed intake"]
["Source: ","Poultry 01","ROSS308"]
["This table contains the assumed bodyweights and cumulative feed intake for the animals based on the ROSS308 performance objectives and the end day of each phase"]
[]
["Diet type","Bodyweight (g)","Cum. feed intake (g) ","FCR","Cum Feed Intake (g) (adjusted for FCR and 7 day mortality)","Wholewheat intake (%)","Compound feed intake (%)","Wholewheat intake (g)","Compound feed intake (g)","Sum of feed (g)"]
[{"$f":"'Diet input details'!C6","v":"Editable entry cell"},{"$f":"VLOOKUP('Diet input details'!E20,Perf_Data,2)","v":0},{"$f":"VLOOKUP('Diet input details'!E20,Perf_Data,7)","v":0},{"$f":"VLOOKUP('Diet input details'!E20,Perf_Data,8)","v":0},{"$f":"VLOOKUP('Diet input details'!E20,Perf_Data,10)","v":0},{"$f":"'Diet input details'!F20","v":0},{"$f":"1-F8","v":1},{"$f":"IF(Table1_bw_feed_intake[[#This Row],[Cum Feed Intake (g) (adjusted for FCR and 7 day mortality)]]>0,F8*E8,0)","v":0},{"$f":"IF(Table1_bw_feed_intake[[#This Row],[Cum Feed Intake (g) (adjusted for FCR and 7 day mortality)]]>0,G8*E8,0)","v":0},"N/A"]
[{"$f":"'Diet input details'!C7","v":"Editable entry cell"},{"$f":"VLOOKUP('Diet input details'!E21,Perf_Data,2)","v":0},{"$f":"VLOOKUP('Diet input details'!E21,Perf_Data,7)","v":0},{"$f":"VLOOKUP('Diet input details'!E21,Perf_Data,8)","v":0},{"$f":"VLOOKUP('Diet input details'!E21,Perf_Data,10)","v":0},{"$f":"'Diet input details'!F21","v":0},{"$f":"1-F9","v":1},{"$f":"IF(Table1_bw_feed_intake[[#This Row],[Cum Feed Intake (g) (adjusted for FCR and 7 day mortality)]]>0,F9*(E9-E8),0)","v":0},{"$f":"IF(Table1_bw_feed_intake[[#This Row],[Cum Feed Intake (g) (adjusted for FCR and 7 day mortality)]]>0,G9*(E9-E8),0)","v":0},"N/A"]
[{"$f":"'Diet input details'!C8","v":"Editable entry cell"},{"$f":"VLOOKUP('Diet input details'!E22,Perf_Data,2)","v":0},{"$f":"VLOOKUP('Diet input details'!E22,Perf_Data,7)","v":0},{"$f":"VLOOKUP('Diet input details'!E22,Perf_Data,8)","v":0},{"$f":"VLOOKUP('Diet input details'!E22,Perf_Data,10)","v":0},{"$f":"'Diet input details'!F22","v":0},1,{"$f":"IF(Table1_bw_feed_intake[[#This Row],[Cum Feed Intake (g) (adjusted for FCR and 7 day mortality)]]>0,F10*(E10-E9),0)","v":0},{"$f":"IF(Table1_bw_feed_intake[[#This Row],[Cum Feed Intake (g) (adjusted for FCR and 7 day mortality)]]>0,G10*(E10-E9),0)","v":0},"N/A"]
[{"$f":"'Diet input details'!C9","v":"Editable entry cell"},{"$f":"VLOOKUP('Diet input details'!E23,Perf_Data,2)","v":0},{"$f":"VLOOKUP('Diet input details'!E23,Perf_Data,7)","v":0},{"$f":"VLOOKUP('Diet input details'!E23,Perf_Data,8)","v":0},{"$f":"VLOOKUP('Diet input details'!E23,Perf_Data,10)","v":0},{"$f":"'Diet input details'!F23","v":0},1,{"$f":"IF(Table1_bw_feed_intake[[#This Row],[Cum Feed Intake (g) (adjusted for FCR and 7 day mortality)]]>0,F11*(E11-E10),0)","v":0},{"$f":"IF(Table1_bw_feed_intake[[#This Row],[Cum Feed Intake (g) (adjusted for FCR and 7 day mortality)]]>0,G11*(E11-E10),0)","v":0},"N/A"]
[{"$f":"'Diet input details'!C10","v":"Editable entry cell"},{"$f":"VLOOKUP('Diet input details'!E24,Perf_Data,2)","v":0},{"$f":"VLOOKUP('Diet input details'!E24,Perf_Data,7)","v":0},{"$f":"VLOOKUP('Diet input details'!E24,Perf_Data,8)","v":0},{"$f":"VLOOKUP('Diet input details'!E24,Perf_Data,10)","v":0},{"$f":"'Diet input details'!F24","v":0},1,{"$f":"IF(Table1_bw_feed_intake[[#This Row],[Cum Feed Intake (g) (adjusted for FCR and 7 day mortality)]]>0,F12*(E12-E11),0)","v":0},{"$f":"IF(Table1_bw_feed_intake[[#This Row],[Cum Feed Intake (g) (adjusted for FCR and 7 day mortality)]]>0,G12*(E12-E11),0)","v":0},"N/A"]
[{"$f":"'Diet input details'!C11","v":"Editable entry cell"},{"$f":"VLOOKUP('Diet input details'!E25,Perf_Data,2)","v":0},{"$f":"VLOOKUP('Diet input details'!E25,Perf_Data,7)","v":0},{"$f":"VLOOKUP('Diet input details'!E25,Perf_Data,8)","v":0},{"$f":"VLOOKUP('Diet input details'!E25,Perf_Data,10)","v":0},{"$f":"'Diet input details'!F25","v":0},1,{"$f":"IF(Table1_bw_feed_intake[[#This Row],[Cum Feed Intake (g) (adjusted for FCR and 7 day mortality)]]>0,F13*(E13-E12),0)","v":0},{"$f":"IF(Table1_bw_feed_intake[[#This Row],[Cum Feed Intake (g) (adjusted for FCR and 7 day mortality)]]>0,G13*(E13-E12),0)","v":0},"N/A"]
[{"$f":"'Diet input details'!C12","v":"Editable entry cell"},{"$f":"VLOOKUP('Diet input details'!E26,Perf_Data,2)","v":0},{"$f":"VLOOKUP('Diet input details'!E26,Perf_Data,7)","v":0},{"$f":"VLOOKUP('Diet input details'!E26,Perf_Data,8)","v":0},{"$f":"VLOOKUP('Diet input details'!E26,Perf_Data,10)","v":0},{"$f":"'Diet input details'!F26","v":0},1,{"$f":"IF(Table1_bw_feed_intake[[#This Row],[Cum Feed Intake (g) (adjusted for FCR and 7 day mortality)]]>0,F14*(E14-E13),0)","v":0},{"$f":"IF(Table1_bw_feed_intake[[#This Row],[Cum Feed Intake (g) (adjusted for FCR and 7 day mortality)]]>0,G14*(E14-E13),0)","v":0},"N/A"]
[{"$f":"'Diet input details'!C13","v":"Editable entry cell"},{"$f":"VLOOKUP('Diet input details'!E27,Perf_Data,2)","v":0},{"$f":"VLOOKUP('Diet input details'!E27,Perf_Data,7)","v":0},{"$f":"VLOOKUP('Diet input details'!E27,Perf_Data,8)","v":0},{"$f":"VLOOKUP('Diet input details'!E27,Perf_Data,10)","v":0},{"$f":"'Diet input details'!F27","v":0},1,{"$f":"IF(Table1_bw_feed_intake[[#This Row],[Cum Feed Intake (g) (adjusted for FCR and 7 day mortality)]]>0,F15*(E15-E14),0)","v":0},{"$f":"IF(Table1_bw_feed_intake[[#This Row],[Cum Feed Intake (g) (adjusted for FCR and 7 day mortality)]]>0,G15*(E15-E14),0)","v":0},"N/A"]
{"$rows_left_out":156}